Target
Estrogen receptor
Ligand
BDBM443429
Substrate
Meas. Tech.
ERalpha (Wild Type), ERalpha (Y537ERalpha (Wild Type), ERalph (Y537S Mutant) and ERbeta Competition Binding Assay
Ki
0.310±0.38 nM
Citation
 Bastian, JACohen, JDRubio, ASall, DJMcMahon, JA Selective estrogen receptor degraders US Patent  US11117902 Publication Date 9/14/2021 
Target
Name:
Estrogen receptor
Synonyms:
ER ESR ESR1_HUMAN Estrogen receptor Estrogen receptor (ER-alpha) Estrogen receptor alpha (ER) Nuclear receptor subfamily 3 group A member 1
Type:
Protein
Mol. Mass.:
66230.44
Organism:
Homo sapiens (Human)
Description:
P03372
Residue:
595
  
Inhibitor
Name:
BDBM443429
Synonyms:
US10654866, Example 1A US11634426, Example 1A
Type:
Small organic molecule
Emp. Form.:
C29H24F4N2O3
Mol. Mass.:
524.5061
SMILES:
Oc1ccc2c3[C@H](Oc4cc(ccc4-c3cnc2c1)C(F)(F)F)c1ccc(OCCN2CC(CF)C2)cc1
: