Target
Adenosine receptor A2a
Ligand
BDBM303297
Substrate
Meas. Tech.
A2a Ki assay
Ki
0.900±n/a nM
Citation
 Ali, AKuang, RLim, YLo, MMTing, PCBiju, Pde Lera Ruiz, MDegrado, SJTung, ALHenderson, TJHong, LKim, JKim, DWLee, JWu, JWu, HXiao, YYu, TZhou, GZhu, XMcCormick, KDTagat, JRXiao, DKhan, TCao, JBerlin, MZhang, Y Aminoquinazoline compounds as A2A antagonist US Patent  US10138212 Publication Date 11/27/2018 
Target
Name:
Adenosine receptor A2a
Synonyms:
A2A adenosine receptor (hA2A) ADENOSINE A2 ADORA2 Adenosine A2A receptor (A2AAR)
Type:
G Protein-Coupled Receptor (GPCR)
Mol. Mass.:
44716.46
Organism:
Homo sapiens (Human)
Description:
P29274
Residue:
412
  
Inhibitor
Name:
BDBM303297
Synonyms:
2-amino-8-methoxy-N- [(1-methyl-2-oxo-3- pyridyl)methyl]quinazoline- 4-carboxamide | US10138212, Example 61
Type:
Small organic molecule
Emp. Form.:
C17H17N5O3
Mol. Mass.:
339.3486
SMILES:
COc1cccc2c(nc(N)nc12)C(=O)NCc1cccn(C)c1=O
: