Target
Receptor-interacting serine/threonine-protein kinase 2
Ligand
BDBM303882
Substrate
Meas. Tech.
Inhibition Assay
IC50
5.50±n/a nM
Citation
 Liu, PMiller, CAYu, MZhang, ZRuppel, SPadayana, AK Substituted benzamides as RIPK2 inhibitors US Patent  US11130754 Publication Date 9/28/2021 
Target
Name:
Receptor-interacting serine/threonine-protein kinase 2
Synonyms:
CARDIAK RIP2 RIPK2_HUMAN Tyrosine-protein kinase RIPK2 | receptor-interacting serine/threonine-protein kinase 2
Type:
Protein
Mol. Mass.:
61201.30
Organism:
Homo sapiens (Human)
Description:
Residue:
540
  
Inhibitor
Name:
BDBM303882
Synonyms:
US10138241, Example 70 | US11130754, Example 70
Type:
Small organic molecule
Emp. Form.:
C27H28FN7O2
Mol. Mass.:
501.5553
SMILES:
CN1CCN(CC1)C(=O)c1ccc2ncc(-n3cc(cn3)-c3cc(C(=O)NC4CC4)c(F)cc3C)n2c1
: