Target
Induced myeloid leukemia cell differentiation protein Mcl-1
Ligand
BDBM520300
Substrate
Meas. Tech.
Fluorescence Polarization Competition Assay
Ki
7.40±n/a nM
Citation
 Zhuo, JLeal, RShetty, RLuengo, JCombs, APWei, P Spiro-sulfonamide derivatives as inhibitors of myeloid cell leukemia-1 (MCL-1) protein US Patent  US11130769 Publication Date 9/28/2021 
Target
Name:
Induced myeloid leukemia cell differentiation protein Mcl-1
Synonyms:
BCL2L3 Bcl-2-like protein 3 (Mcl-1) Bcl2-L-3 MCL1 Mcl-1 Myeloid cell leukemia sequence 1 (BCL2-related) | mcl1/EAT
Type:
Membrane; Single-pass membrane protein
Mol. Mass.:
37332.87
Organism:
Homo sapiens (Human)
Description:
Q07820
Residue:
350
  
Inhibitor
Name:
BDBM520300
Synonyms:
2-(6-Methyl-3-pyridyl)-N-[(3S)-6′-chloro-5-(cyclobutylmethyl)spiro[2,4-dihydro-1,5-benzoxazepine-3,1′-tetralin]-7-yl]sulfonyl-acetamide | US11130769, Ex. No. 17
Type:
Small organic molecule
Emp. Form.:
C31H34ClN3O4S
Mol. Mass.:
580.137
SMILES:
Cc1ccc(CC(=O)NS(=O)(=O)c2ccc3OC[C@]4(CCCc5cc(Cl)ccc45)CN(CC4CCC4)c3c2)cn1
: