Target
Induced myeloid leukemia cell differentiation protein Mcl-1
Ligand
BDBM520552
Substrate
Meas. Tech.
Fluorescence Polarization Competition Assay
Ki
<100±n/a nM
Citation
 Zhuo, JLeal, RShetty, RLuengo, JCombs, APWei, P Spiro-sulfonamide derivatives as inhibitors of myeloid cell leukemia-1 (MCL-1) protein US Patent  US11130769 Publication Date 9/28/2021 
Target
Name:
Induced myeloid leukemia cell differentiation protein Mcl-1
Synonyms:
BCL2L3 Bcl-2-like protein 3 (Mcl-1) Bcl2-L-3 MCL1 Mcl-1 Myeloid cell leukemia sequence 1 (BCL2-related) | mcl1/EAT
Type:
Membrane; Single-pass membrane protein
Mol. Mass.:
37332.87
Organism:
Homo sapiens (Human)
Description:
Q07820
Residue:
350
  
Inhibitor
Name:
BDBM520552
Synonyms:
(3R,6R,7S,8E,22R)-6′-Chloro-7-hydroxy-12,12-dimethyl-15,15-dioxo-spiro[11,20-dioxa-15-thia-1,14-diazatetracyclo[14.7.2.03,6.019,24]pentacosa-8,16,18,24-tetraene-22,1′-isochromane]-13-one | US11130769, Ex. No. 249
Type:
Small organic molecule
Emp. Form.:
C30H35ClN2O7S
Mol. Mass.:
603.126
SMILES:
CC1(C)OC\C=C\[C@H](O)[C@@H]2CC[C@H]2CN2C[C@]3(COc4ccc(cc24)S(=O)(=O)NC1=O)OCCc1cc(Cl)ccc31
: