Target
Induced myeloid leukemia cell differentiation protein Mcl-1
Ligand
BDBM520560
Substrate
Meas. Tech.
Fluorescence Polarization Competition Assay
Ki
<100±n/a nM
Citation
 Zhuo, JLeal, RShetty, RLuengo, JCombs, APWei, P Spiro-sulfonamide derivatives as inhibitors of myeloid cell leukemia-1 (MCL-1) protein US Patent  US11130769 Publication Date 9/28/2021 
Target
Name:
Induced myeloid leukemia cell differentiation protein Mcl-1
Synonyms:
BCL2L3 Bcl-2-like protein 3 (Mcl-1) Bcl2-L-3 MCL1 Mcl-1 Myeloid cell leukemia sequence 1 (BCL2-related) | mcl1/EAT
Type:
Membrane; Single-pass membrane protein
Mol. Mass.:
37332.87
Organism:
Homo sapiens (Human)
Description:
Q07820
Residue:
350
  
Inhibitor
Name:
BDBM520560
Synonyms:
1,1,3-Trimethyl-3-[(3R,6R,7S,8E,22S)-6′-chloro-12,12-dimethyl-13,15,15-trioxo-spiro[11,20-dioxa-15-thia-1,14-diazatetracyclo[14.7.2.03,6.019,24]pentacosa-8,16(25),17,19 | US11130769, Ex. No. 257
Type:
Small organic molecule
Emp. Form.:
C35H45ClN4O6S
Mol. Mass.:
685.273
SMILES:
CN(C)C(=O)N(C)[C@H]1\C=C\COC(C)(C)C(=O)NS(=O)(=O)c2ccc3OC[C@]4(CCCc5cc(Cl)ccc45)CN(C[C@@H]4CC[C@@H]14)c3c2
: