Target
Induced myeloid leukemia cell differentiation protein Mcl-1
Ligand
BDBM520568
Substrate
Meas. Tech.
Fluorescence Polarization Competition Assay
Ki
<100±n/a nM
Citation
 Zhuo, JLeal, RShetty, RLuengo, JCombs, APWei, P Spiro-sulfonamide derivatives as inhibitors of myeloid cell leukemia-1 (MCL-1) protein US Patent  US11130769 Publication Date 9/28/2021 
Target
Name:
Induced myeloid leukemia cell differentiation protein Mcl-1
Synonyms:
BCL2L3 Bcl-2-like protein 3 (Mcl-1) Bcl2-L-3 MCL1 Mcl-1 Myeloid cell leukemia sequence 1 (BCL2-related) | mcl1/EAT
Type:
Membrane; Single-pass membrane protein
Mol. Mass.:
37332.87
Organism:
Homo sapiens (Human)
Description:
Q07820
Residue:
350
  
Inhibitor
Name:
BDBM520568
Synonyms:
(3R,6R,7S,8E,22S)-6′-Chloro-7-[2-[(3S)-3-fluoropyrrolidin-1-yl]ethoxy]-12,12-dimethyl-15,15-dioxo-spiro[11,20-dioxa-15-thia-1,14-diazatetracyclo[14.7.2.03,6.019,24]pentacosa-8,16,18,24-tetraene-22,1′-tetralin]-13-one | US11130769, Ex. No. 265
Type:
Small organic molecule
Emp. Form.:
C37H47ClFN3O6S
Mol. Mass.:
716.302
SMILES:
CC1(C)OC\C=C\[C@H](OCCN2CC[C@H](F)C2)[C@@H]2CC[C@H]2CN2C[C@@]3(CCCc4cc(Cl)ccc34)COc3ccc(cc23)S(=O)(=O)NC1=O
: