Target
Induced myeloid leukemia cell differentiation protein Mcl-1
Ligand
BDBM520597
Substrate
Meas. Tech.
Fluorescence Polarization Competition Assay
Ki
<100±n/a nM
Citation
 Zhuo, JLeal, RShetty, RLuengo, JCombs, APWei, P Spiro-sulfonamide derivatives as inhibitors of myeloid cell leukemia-1 (MCL-1) protein US Patent  US11130769 Publication Date 9/28/2021 
Target
Name:
Induced myeloid leukemia cell differentiation protein Mcl-1
Synonyms:
BCL2L3 Bcl-2-like protein 3 (Mcl-1) Bcl2-L-3 MCL1 Mcl-1 Myeloid cell leukemia sequence 1 (BCL2-related) | mcl1/EAT
Type:
Membrane; Single-pass membrane protein
Mol. Mass.:
37332.87
Organism:
Homo sapiens (Human)
Description:
Q07820
Residue:
350
  
Inhibitor
Name:
BDBM520597
Synonyms:
US11130769, Ex. No. 294 | [(3R,6R,7S,8E,15S,25S)-6′-Chloro-16,18,18-trioxo-spiro[23-oxa-18-thia-1,11,17-triazapentacyclo[17.7.2.03,6.011,15.022,27]octacosa-8,19,21,27-tetraene-25,1′-tetralin]-7-yl] N,N-dimethylcarbamate
Type:
Small organic molecule
Emp. Form.:
C35H43ClN4O6S
Mol. Mass.:
683.257
SMILES:
CN(C)C(=O)O[C@H]1\C=C\CN2CCC[C@H]2C(=O)NS(=O)(=O)c2ccc3OC[C@]4(CCCc5cc(Cl)ccc45)CN(C[C@@H]4CC[C@@H]14)c3c2
: