Target
Glutamate receptor ionotropic, NMDA 2A
Ligand
BDBM521589
Substrate
Meas. Tech.
Whole-Cell Patch Clamp of Mammalian Cells (Ionworks Barracuda (IWB))
EC50
69.7±n/a nM
Citation
 Salituro, FGRobichaud, AJMartinez Botella, GHarrison, BLGriffin, A Oxysterols and methods of use thereof US Patent  US11149054 Publication Date 10/19/2021 
Target
Name:
Glutamate receptor ionotropic, NMDA 2A
Synonyms:
GRIN2A Glutamate [NMDA] receptor Glutamate [NMDA] receptor subunit epsilon-1 NMDA receptor subtype 2A protein (NR2A) NMDE1_HUMAN hNR2A
Type:
Mol. Mass.:
165293.76
Organism:
Homo sapiens (Human)
Description:
Residue:
1464
  
Inhibitor
Name:
BDBM521589
Synonyms:
US11149054, Compound 3149
Type:
Small organic molecule
Emp. Form.:
C26H38F6O2
Mol. Mass.:
496.5691
SMILES:
C[C@H](CC[C@@H](O)C(F)(F)F)[C@H]1CC[C@H]2[C@@H]3CC=C4C[C@@](O)(CC[C@]4(C)[C@H]3CC[C@]12C)C(F)(F)F
: