Target
Thioredoxin reductase 1, cytoplasmic
Ligand
BDBM522149
Substrate
Meas. Tech.
Inhibition of Recombinant TrxR1
IC50
181±n/a nM
Citation
 Pelcman, BSuna, EStafford, WPriede, M Hydrocarbylsulfonyl-substituted pyridines and their use in the treatment of cancer US Patent  US11161815 Publication Date 11/2/2021 
Target
Name:
Thioredoxin reductase 1, cytoplasmic
Synonyms:
GRIM-12 Gene associated with retinoid-IFN-induced mortality 12 protein KM-102-derived reductase-like factor TRXR1_HUMAN Thioredoxin reductase 1 Thioredoxin reductase TR1
Type:
Protein
Mol. Mass.:
70761.78
Organism:
Homo sapiens (Human)
Description:
Q16881
Residue:
648
  
Inhibitor
Name:
BDBM522149
Synonyms:
US11161815, Example 5
Type:
Small organic molecule
Emp. Form.:
C10H11ClN2O4S
Mol. Mass.:
290.723
SMILES:
[O-][N+](=O)c1ccc(Cl)nc1S(=O)(=O)C1CCCC1
: