Target
Thioredoxin reductase 1, cytoplasmic
Ligand
BDBM522174
Substrate
Meas. Tech.
Inhibition of Recombinant TrxR1
IC50
66.9±n/a nM
Citation
 Pelcman, BSuna, EStafford, WPriede, M Hydrocarbylsulfonyl-substituted pyridines and their use in the treatment of cancer US Patent  US11161815 Publication Date 11/2/2021 
Target
Name:
Thioredoxin reductase 1, cytoplasmic
Synonyms:
GRIM-12 Gene associated with retinoid-IFN-induced mortality 12 protein KM-102-derived reductase-like factor TRXR1_HUMAN Thioredoxin reductase 1 Thioredoxin reductase TR1
Type:
Protein
Mol. Mass.:
70761.78
Organism:
Homo sapiens (Human)
Description:
Q16881
Residue:
648
  
Inhibitor
Name:
BDBM522174
Synonyms:
US11161815, Example 30
Type:
Small organic molecule
Emp. Form.:
C12H12N4O5S
Mol. Mass.:
324.312
SMILES:
COc1ccc(c(n1)S(=O)(=O)CCc1cnccn1)[N+]([O-])=O
: