Target
Ubiquitin carboxyl-terminal hydrolase 1
Ligand
BDBM325245
Substrate
Meas. Tech.
HTS Assay
IC50
1100±n/a nM
Citation
 Buckmelter, AJIoannidis, SFollows, BGustafson, GWang, MCaravella, JAWang, ZFritzen, ELLin, J Purinones as ubiquitin-specific protease 1 inhibitors US Patent  US11161848 Publication Date 11/2/2021 
Target
Name:
Ubiquitin carboxyl-terminal hydrolase 1
Synonyms:
Deubiquitinating enzyme 1 USP1 Ubiquitin thioesterase 1 hUBP
Type:
PROTEIN
Mol. Mass.:
88191.62
Organism:
Homo sapiens (Human)
Description:
ChEMBL_104169
Residue:
785
  
Inhibitor
Name:
BDBM325245
Synonyms:
2-(2-isopropylphenyl)-7- US10399980, Compound I-451 | US11161848, Compound I-451
Type:
Small organic molecule
Emp. Form.:
C25H31N7O3S
Mol. Mass.:
509.624
SMILES:
CC(C)c1ccccc1-c1ncc2n(C)c(=O)n(CC3CCN(CC3)S(=O)(=O)c3nccn3C)c2n1
: