Target
Transient receptor potential cation channel subfamily A member 1
Ligand
BDBM524051
Substrate
Meas. Tech.
TRPA1 Assay
IC50
20.0±n/a nM
Citation
 Fleck, MTBinder, FPDahmann, GHehn, JPHeimann, ACWillwacher, J Thienopyrimidones US Patent  US11136336 Publication Date 10/5/2021 
Target
Name:
Transient receptor potential cation channel subfamily A member 1
Synonyms:
ANKTM1 TRPA1 Transformation-sensitive protein p120 | Transient receptor potential cation channel subfamily A member 1 (TRPA1)
Type:
Protein
Mol. Mass.:
127514.20
Organism:
Homo sapiens (Human)
Description:
O75762
Residue:
1119
  
Inhibitor
Name:
BDBM524051
Synonyms:
US11136336, Example 2
Type:
Small organic molecule
Emp. Form.:
C20H19N5O4S
Mol. Mass.:
425.461
SMILES:
Cc1c(sc2ncn(Cc3nc(C[C@H](O)c4ccc(C)cc4)no3)c(=O)c12)C(N)=O
: