Target
Transient receptor potential cation channel subfamily A member 1
Ligand
BDBM524064
Substrate
Meas. Tech.
TRPA1 Assay
IC50
9.00±n/a nM
Citation
 Fleck, MTBinder, FPDahmann, GHehn, JPHeimann, ACWillwacher, J Thienopyrimidones US Patent  US11136336 Publication Date 10/5/2021 
Target
Name:
Transient receptor potential cation channel subfamily A member 1
Synonyms:
ANKTM1 TRPA1 Transformation-sensitive protein p120 | Transient receptor potential cation channel subfamily A member 1 (TRPA1)
Type:
Protein
Mol. Mass.:
127514.20
Organism:
Homo sapiens (Human)
Description:
O75762
Residue:
1119
  
Inhibitor
Name:
BDBM524064
Synonyms:
US11136336, Example 15
Type:
Small organic molecule
Emp. Form.:
C20H16ClN5O4S
Mol. Mass.:
457.89
SMILES:
O[C@@H](Cc1noc(Cn2cnc3sc4c(CCNC4=O)c3c2=O)n1)c1ccc(Cl)cc1
: