Target
Transient receptor potential cation channel subfamily A member 1
Ligand
BDBM524065
Substrate
Meas. Tech.
TRPA1 Assay
IC50
16.0±n/a nM
Citation
 Fleck, MTBinder, FPDahmann, GHehn, JPHeimann, ACWillwacher, J Thienopyrimidones US Patent  US11136336 Publication Date 10/5/2021 
Target
Name:
Transient receptor potential cation channel subfamily A member 1
Synonyms:
ANKTM1 TRPA1 Transformation-sensitive protein p120 | Transient receptor potential cation channel subfamily A member 1 (TRPA1)
Type:
Protein
Mol. Mass.:
127514.20
Organism:
Homo sapiens (Human)
Description:
O75762
Residue:
1119
  
Inhibitor
Name:
BDBM524065
Synonyms:
US11136336, Example 16
Type:
Small organic molecule
Emp. Form.:
C18H13Cl2N5O4S
Mol. Mass.:
466.298
SMILES:
NC(=O)c1sc2ncn(Cc3nc(C[C@H](O)c4ccc(Cl)cc4)no3)c(=O)c2c1Cl
: