Target
Transient receptor potential cation channel subfamily A member 1
Ligand
BDBM524067
Substrate
Meas. Tech.
TRPA1 Assay
IC50
14.0±n/a nM
Citation
 Fleck, MTBinder, FPDahmann, GHehn, JPHeimann, ACWillwacher, J Thienopyrimidones US Patent  US11136336 Publication Date 10/5/2021 
Target
Name:
Transient receptor potential cation channel subfamily A member 1
Synonyms:
ANKTM1 TRPA1 Transformation-sensitive protein p120 | Transient receptor potential cation channel subfamily A member 1 (TRPA1)
Type:
Protein
Mol. Mass.:
127514.20
Organism:
Homo sapiens (Human)
Description:
O75762
Residue:
1119
  
Inhibitor
Name:
BDBM524067
Synonyms:
7-Bromo-3-((3-(2-(4-chlorophenyl)-2-hydroxyethyl)-1,2,4-oxadiazol-5-yl)methyl)-5-methylimidazo[5,1-f][1,2,4]triazin-4(3H)-one | US11136336, WO2017/060488 Example 72
Type:
Small organic molecule
Emp. Form.:
C17H14BrClN6O3
Mol. Mass.:
465.688
SMILES:
Cc1nc(Br)n2ncn(Cc3nc(CC(O)c4ccc(Cl)cc4)no3)c(=O)c12
: