Target
Dynamin-1-like protein
Ligand
BDBM524269
Substrate
Meas. Tech.
Drp1 Activity Screen
IC50
1200±n/a nM
Citation
 Ji, NSeenisamy, JN Dynamin-1-like protein inhibitors US Patent  US11168080 Publication Date 11/9/2021 
Target
Name:
Dynamin-1-like protein
Synonyms:
DLP1 DNM1L_HUMAN DVLP Dymple Dynamin-like protein Dynamin-like protein IV HdynIV
Type:
Protein
Mol. Mass.:
81878.71
Organism:
Human
Description:
O00429
Residue:
736
  
Inhibitor
Name:
BDBM524269
Synonyms:
Preparation of N-(4-(furan-3-yl)phenyl)-4-methyl-1-((2-(piperidin-1-yl)thiazol-4-yl)methyl)-1H-pyrrole-2-carboxamide | US11168080, Compound A-38
Type:
Small organic molecule
Emp. Form.:
C25H26N4O2S
Mol. Mass.:
446.565
SMILES:
Cc1cc(C(=O)Nc2ccc(cc2)-c2ccoc2)n(Cc2csc(n2)N2CCCCC2)c1
: