Target
Dynamin-1-like protein
Ligand
BDBM524282
Substrate
Meas. Tech.
Drp1 Activity Screen
IC50
5600±n/a nM
Citation
 Ji, NSeenisamy, JN Dynamin-1-like protein inhibitors US Patent  US11168080 Publication Date 11/9/2021 
Target
Name:
Dynamin-1-like protein
Synonyms:
DLP1 DNM1L_HUMAN DVLP Dymple Dynamin-like protein Dynamin-like protein IV HdynIV
Type:
Protein
Mol. Mass.:
81878.71
Organism:
Human
Description:
O00429
Residue:
736
  
Inhibitor
Name:
BDBM524282
Synonyms:
Preparation of Methyl 4-(1-((2-(1H-pyrazol-4-yl)thiazol-4-yl)methyl)-4-methyl-1H-pyrrole-2-carboxamido)benzoate | US11168080, Compound A-49
Type:
Small organic molecule
Emp. Form.:
C19H17N5OS
Mol. Mass.:
363.436
SMILES:
Cc1cc(C(=O)Nc2ccccc2)n(Cc2csc(n2)-c2cn[nH]c2)c1
: