Target
Cyclin-K/Cyclin-dependent kinase 9
Ligand
BDBM525730
Substrate
Meas. Tech.
LanthaScreen Eu Kinase Binding Assay
IC50
5.00±n/a nM
Citation
 Pham, SMChakravarty, SKankanala, JPujala, BShete, ABhatt, BAgarwal, AKSoni, SChen, J Heterocyclic compounds as kinase inhibitors US Patent  US11174252 Publication Date 11/16/2021 
Target
Name:
Cyclin-K/Cyclin-dependent kinase 9
Synonyms:
CDK9/Cyclin K
Type:
Mol. Mass.:
Description:
ASSAY_ID of ChEMBL is 956649
Components:
This complex has 2 components.
Component 1
Name:
Cyclin-dependent kinase 9
Synonyms:
C-2K CDK9 Cell division cycle 2-like protein kinase 4 Cyclin-Dependent Kinase 9 (CDK9) Serine/threonine-protein kinase PITALRE Tat-associated kinase complex catalytic subunit
Type:
Enzyme Subunit
Mol. Mass.:
42789.13
Organism:
Homo sapiens (Human)
Description:
Residue:
372
  
Component 2
Name:
Cyclin-K
Synonyms:
CCNK CPR4
Type:
PROTEIN
Mol. Mass.:
64254.10
Organism:
Homo sapiens (Human)
Description:
ChEMBL_107901
Residue:
580
  
Inhibitor
Name:
BDBM525730
Synonyms:
US11174252, Compound 25
Type:
Small organic molecule
Emp. Form.:
C28H33F3N6O
Mol. Mass.:
526.5964
SMILES:
CC(C)N1CCOc2c(F)cc(cc12)-c1nc(Nc2ccc(N3CCC(CC3)N(C)C)c(F)c2)ncc1F
: