Target
Acetyl-CoA carboxylase 2
Ligand
BDBM527058
Substrate
Meas. Tech.
ACC2 Enzyme Activity Assay
IC50
6.85±n/a nM
Citation
 Wang, YZhao, LWang, YQuan, XJiang, CChen, HChen, MLi, CLiao, YLiu, QWang, CWang, HYang, SZheng, G Compound as ACC inhibitor and use thereof US Patent  US11186587 Publication Date 11/30/2021 
Target
Name:
Acetyl-CoA carboxylase 2
Synonyms:
ACACB ACC-beta ACCB Acetyl-CoA carboxylase 2 Acetyl-CoA carboxylase 2 (ACC2)
Type:
Protein
Mol. Mass.:
276535.21
Organism:
Homo sapiens (Human)
Description:
O00763
Residue:
2458
  
Inhibitor
Name:
BDBM527058
Synonyms:
US11186587, Example 10
Type:
Small organic molecule
Emp. Form.:
C29H34N4O8S2
Mol. Mass.:
630.732
SMILES:
CCS(=O)(=O)N1CC(C1)n1c(=O)n(CC(OC2CCOCC2)c2ccccc2OC)c2sc(c(C)c2c1=O)-c1ncco1
: