Target
Acetyl-CoA carboxylase 1
Ligand
BDBM527541
Substrate
Meas. Tech.
ACC1 Enzyme Activity Assay
IC50
3.06±n/a nM
Citation
 Wang, YZhao, LWang, YQuan, XJiang, CChen, HChen, MLi, CLiao, YLiu, QWang, CWang, HYang, SZheng, G Compound as ACC inhibitor and use thereof US Patent  US11186587 Publication Date 11/30/2021 
Target
Name:
Acetyl-CoA carboxylase 1
Synonyms:
ACAC ACACA_HUMAN ACC1 Acetyl-CoA carboxylase 1 | Acetyl-CoA carboxylase 1 (ACC1)
Type:
Protein
Mol. Mass.:
265543.22
Organism:
Homo sapiens (Human)
Description:
Q13085
Residue:
2346
  
Inhibitor
Name:
BDBM527541
Synonyms:
4-(1-(2-(2-methoxyphenyl)-2-((tetrahydro-2H-pyran-4-yl)oxy)ethyl)-5-methyl-6-(oxazol-2-yl)-2, 4-dioxo-1,4-dihydrothieno[2,3-d]pyrimidin-3(2H)-yl)benzoic Acid | US11186587, Example 24
Type:
Small organic molecule
Emp. Form.:
C31H29N3O8S
Mol. Mass.:
603.642
SMILES:
COc1ccccc1C(Cn1c2sc(c(C)c2c(=O)n(-c2ccc(cc2)C(O)=O)c1=O)-c1ncco1)OC1CCOCC1
: