Target
Tyrosine-protein phosphatase non-receptor type 11
Ligand
BDBM527817
Substrate
Meas. Tech.
Biochemical Assay
IC50
3.30±n/a nM
Citation
 Chin, GClarke, MOHan, XHansen, THu, YEKoltun, DMcFadden, RMish, MRParkhill, EQSperandio, DXu, LYang, H Imidazopyrimidine derivatives US Patent  US11179397 Publication Date 11/23/2021 
Target
Name:
Tyrosine-protein phosphatase non-receptor type 11
Synonyms:
3.1.3.48 PTP-1D PTP2C Protein Tyrosine Phosphatase PPN11/Shp2 Protein-Tyrosine Phosphatase SHP-2 Protein-tyrosine phosphatase 2C SH-PTP3 SHP2 Src homology phosphatase 2 (SHP-2) Tyrosine-protein phosphatase non-receptor type 11 (SHP-2) | Tyrosine-protein phosphatase non-receptor type 11 (SHP2)
Type:
Protein phosphatase
Mol. Mass.:
68443.59
Organism:
Homo sapiens (Human)
Description:
Q06124
Residue:
593
  
Inhibitor
Name:
BDBM527817
Synonyms:
(2S,4R)-4-amino-8- (8-(2,3- dichlorophenyl)-7- methylimidazo[1,2- c]pyrimidin-5-yl)-8- azaspiro[4.5]decan- 2-ol | US11179397, Example 34
Type:
Small organic molecule
Emp. Form.:
C22H25Cl2N5O
Mol. Mass.:
446.373
SMILES:
Cc1nc(N2CCC3(C[C@H](O)C[C@H]3N)CC2)n2ccnc2c1-c1cccc(Cl)c1Cl
: