Target
Tyrosine-protein phosphatase non-receptor type 11
Ligand
BDBM527922
Substrate
Meas. Tech.
Biochemical Assay
IC50
1.80±n/a nM
Citation
 Chin, GClarke, MOHan, XHansen, THu, YEKoltun, DMcFadden, RMish, MRParkhill, EQSperandio, DXu, LYang, H Imidazopyrimidine derivatives US Patent  US11179397 Publication Date 11/23/2021 
Target
Name:
Tyrosine-protein phosphatase non-receptor type 11
Synonyms:
3.1.3.48 PTP-1D PTP2C Protein Tyrosine Phosphatase PPN11/Shp2 Protein-Tyrosine Phosphatase SHP-2 Protein-tyrosine phosphatase 2C SH-PTP3 SHP2 Src homology phosphatase 2 (SHP-2) Tyrosine-protein phosphatase non-receptor type 11 (SHP-2) | Tyrosine-protein phosphatase non-receptor type 11 (SHP2)
Type:
Protein phosphatase
Mol. Mass.:
68443.59
Organism:
Homo sapiens (Human)
Description:
Q06124
Residue:
593
  
Inhibitor
Name:
BDBM527922
Synonyms:
(S)-1'-(8-((2- (methylthio)phenyl) thio)imidazo[1,2- c]pyrimidin-5-yl)- 1,3- dihydrospiro[indene- 2,4'-piperidin]-1- amine | US11179397, Example 141
Type:
Small organic molecule
Emp. Form.:
C26H27N5S2
Mol. Mass.:
473.656
SMILES:
CSc1ccccc1Sc1cnc(N2CCC3(Cc4ccccc4[C@H]3N)CC2)n2ccnc12
: