Target
Tyrosine-protein phosphatase non-receptor type 11
Ligand
BDBM527927
Substrate
Meas. Tech.
Biochemical Assay
IC50
1.70±n/a nM
Citation
 Chin, GClarke, MOHan, XHansen, THu, YEKoltun, DMcFadden, RMish, MRParkhill, EQSperandio, DXu, LYang, H Imidazopyrimidine derivatives US Patent  US11179397 Publication Date 11/23/2021 
Target
Name:
Tyrosine-protein phosphatase non-receptor type 11
Synonyms:
3.1.3.48 PTP-1D PTP2C Protein Tyrosine Phosphatase PPN11/Shp2 Protein-Tyrosine Phosphatase SHP-2 Protein-tyrosine phosphatase 2C SH-PTP3 SHP2 Src homology phosphatase 2 (SHP-2) Tyrosine-protein phosphatase non-receptor type 11 (SHP-2) | Tyrosine-protein phosphatase non-receptor type 11 (SHP2)
Type:
Protein phosphatase
Mol. Mass.:
68443.59
Organism:
Homo sapiens (Human)
Description:
Q06124
Residue:
593
  
Inhibitor
Name:
BDBM527927
Synonyms:
(S)-1'-(8-((2,3- dichlorophenyl)thio) imidazo[1,2- c]pyrimidin-5-yl)- 5,7- dihydrospiro [cyclopenta[b] pyridine-6,4'- piperidin]-5-amine | US11179397, Example 146
Type:
Small organic molecule
Emp. Form.:
C24H22Cl2N6S
Mol. Mass.:
497.443
SMILES:
N[C@@H]1c2cccnc2CC11CCN(CC1)c1ncc(Sc2cccc(Cl)c2Cl)c2nccn12
: