Target
Rod cGMP-specific 3',5'-cyclic phosphodiesterase subunit alpha/beta
Ligand
BDBM528352
Substrate
Meas. Tech.
PDE Enzyme Assays Using [3H]cGMP as Substrate
IC50
611±n/a nM
Citation
 Genin, MJHolloway, WGJohnston, RDMorphy, JRShi, Q [1,2,4]Triazolo[4,3-A]pyrazin-6(5H)-one derivatives US Patent  US11180503 Publication Date 11/23/2021 
Target
Name:
Rod cGMP-specific 3',5'-cyclic phosphodiesterase subunit alpha/beta
Synonyms:
PDE 6AB Rod cGMP-specific 3'''''''',5''''''''-cyclic phosphodiesterase alpha/beta Rod cGMP-specific 3'',5''-cyclic phosphodiesterase alpha/beta | Rod cGMP-specific 3',5'-cyclic phosphodiesterase alpha/beta
Type:
Protein
Mol. Mass.:
Description:
Components:
This complex has 2 components.
Component 1
Name:
Rod cGMP-specific 3',5'-cyclic phosphodiesterase subunit alpha
Synonyms:
PDE6A PDEA | Rod cGMP-specific 3',5'-cyclic phosphodiesterase alpha
Type:
PROTEIN
Mol. Mass.:
99531.10
Organism:
Homo sapiens (Human)
Description:
ChEMBL_1347866
Residue:
860
  
Component 2
Name:
Rod cGMP-specific 3',5'-cyclic phosphodiesterase subunit beta
Synonyms:
GMP-PDE beta PDE6B_HUMAN | PDEB
Type:
PROTEIN
Mol. Mass.:
98308.48
Organism:
Homo sapiens (Human)
Description:
ChEMBL_105761
Residue:
854
  
Inhibitor
Name:
BDBM528352
Synonyms:
9-([1,1'-bi(cyclopropan)]-1-yl)-5-butyl-3-isopropylpyrido[3,2-e][1,2,4]triazolo[4,3-a]pyrazin-6(5H)-one | US11180503, Example 10
Type:
Small organic molecule
Emp. Form.:
C21H27N5O
Mol. Mass.:
365.472
SMILES:
CCCCn1c2cc(cnc2n2c(nnc2c1=O)C1(CC1)C1CC1)C(C)C
: