Target
Orexin receptor type 2
Ligand
BDBM118380
Substrate
Meas. Tech.
Human Orexin 2 Receptor Radioligand Binding Studies
Ki
250±n/a nM
Citation
 Chai, WLetavic, MALy, KSPippel, DJRudolph, DASappey, KCSavall, BMShah, CRShireman, BTSoyode-Johnson, AStocking, EMSwanson, DM Disubstituted octahydropyrrolo[3,4-c]pyrroles as orexin receptor modulators US Patent  USRE48841 Publication Date 12/7/2021 
Target
Name:
Orexin receptor type 2
Synonyms:
HCRTR2 OX2R_HUMAN Orexin receptor type 2 (OR-2) Orexin receptor type 2 (OX2R) Ox-2-R | Ox2-R
Type:
Protein
Mol. Mass.:
50710.53
Organism:
Homo sapiens (Human)
Description:
O43614
Residue:
444
  
Inhibitor
Name:
BDBM118380
Synonyms:
US11059828, Example 33 US8653263, 33 USRE48841, Example 33
Type:
Small organic molecule
Emp. Form.:
C26H23N3OS
Mol. Mass.:
425.545
SMILES:
O=C(N1CC2CN(CC2C1)c1ccc2ccccc2n1)c1ccccc1-c1cccs1
: