Target
Metallo-beta-lactamase VIM-2
Ligand
BDBM530895
Substrate
Meas. Tech.
Enzyme Activity: Determination of IC50
IC50
0.180±n/a nM
Citation
 Pasternak, ADong, SScott, JDTang, HZhao, ZYang, DGu, XJiang, JXiao, L Metallo-beta-lactamase inhibitors and methods of use thereof US Patent  US11207312 Publication Date 12/28/2021 
Target
Name:
Metallo-beta-lactamase VIM-2
Synonyms:
Beta-lactamase VIM-2 | Metallo-beta-lactamase VIM-2 (VIM-2)
Type:
Protein
Mol. Mass.:
28318.00
Organism:
Pseudomonas aeruginosa (g-Proteobacteria)
Description:
Residue:
266
  
Inhibitor
Name:
BDBM530895
Synonyms:
(R)-4-(4-(2-(1H-pyrazol- 1-yl)ethyl)piperidin-1- yl)-N1-(3-amino-2- hydroxypropyl)-3-(2H- tetrazol-5-yl)benzene- 1,2-disulfonamide | US11207312, Example 27
Type:
Small organic molecule
Emp. Form.:
C20H30N10O5S2
Mol. Mass.:
554.646
SMILES:
NC[C@@H](O)CNS(=O)(=O)c1ccc(N2CCC(CCn3cccn3)CC2)c(-c2nn[nH]n2)c1S(N)(=O)=O
: