Target
Metallo-beta-lactamase VIM-2
Ligand
BDBM530911
Substrate
Meas. Tech.
Enzyme Activity: Determination of IC50
IC50
0.610±n/a nM
Citation
 Pasternak, ADong, SScott, JDTang, HZhao, ZYang, DGu, XJiang, JXiao, L Metallo-beta-lactamase inhibitors and methods of use thereof US Patent  US11207312 Publication Date 12/28/2021 
Target
Name:
Metallo-beta-lactamase VIM-2
Synonyms:
Beta-lactamase VIM-2 | Metallo-beta-lactamase VIM-2 (VIM-2)
Type:
Protein
Mol. Mass.:
28318.00
Organism:
Pseudomonas aeruginosa (g-Proteobacteria)
Description:
Residue:
266
  
Inhibitor
Name:
BDBM530911
Synonyms:
N1-(2- aminoethyl)-4-(4- (hydroxymethyl) piperidin-1-yl)-3- (1H-tetrazol-5- yl)benzene-1,2- disulfonamide | US11207312, Example 43
Type:
Small organic molecule
Emp. Form.:
C15H24N8O5S2
Mol. Mass.:
460.532
SMILES:
NCCNS(=O)(=O)c1ccc(N2CCC(CO)CC2)c(-c2nnn[nH]2)c1S(N)(=O)=O
: