Target
Metallo-beta-lactamase VIM-2
Ligand
BDBM530914
Substrate
Meas. Tech.
Enzyme Activity: Determination of IC50
IC50
0.320±n/a nM
Citation
 Pasternak, ADong, SScott, JDTang, HZhao, ZYang, DGu, XJiang, JXiao, L Metallo-beta-lactamase inhibitors and methods of use thereof US Patent  US11207312 Publication Date 12/28/2021 
Target
Name:
Metallo-beta-lactamase VIM-2
Synonyms:
Beta-lactamase VIM-2 | Metallo-beta-lactamase VIM-2 (VIM-2)
Type:
Protein
Mol. Mass.:
28318.00
Organism:
Pseudomonas aeruginosa (g-Proteobacteria)
Description:
Residue:
266
  
Inhibitor
Name:
BDBM530914
Synonyms:
(R)-N1-(1- aminopropan-2- yl)-4-(4- (hydroxymethyl) piperidin-1-yl)-3- (1H-tetrazol-5- yl)benzene-1,2- disulfonamide | US11207312, Example 46
Type:
Small organic molecule
Emp. Form.:
C16H26N8O5S2
Mol. Mass.:
474.558
SMILES:
C[C@H](CN)NS(=O)(=O)c1ccc(N2CCC(CO)CC2)c(-c2nnn[nH]2)c1S(N)(=O)=O
: