Target
Metallo-beta-lactamase VIM-2
Ligand
BDBM530924
Substrate
Meas. Tech.
Enzyme Activity: Determination of IC50
IC50
0.820±n/a nM
Citation
 Pasternak, ADong, SScott, JDTang, HZhao, ZYang, DGu, XJiang, JXiao, L Metallo-beta-lactamase inhibitors and methods of use thereof US Patent  US11207312 Publication Date 12/28/2021 
Target
Name:
Metallo-beta-lactamase VIM-2
Synonyms:
Beta-lactamase VIM-2 | Metallo-beta-lactamase VIM-2 (VIM-2)
Type:
Protein
Mol. Mass.:
28318.00
Organism:
Pseudomonas aeruginosa (g-Proteobacteria)
Description:
Residue:
266
  
Inhibitor
Name:
BDBM530924
Synonyms:
6-(azetidin-3-ylsulfonyl)-3-[4- (2-hydroxyethyl)piperidin-1- yl]-2-(1H-tetrazol-5- yl)benzenesulfonamide | US11207312, Example 56
Type:
Small organic molecule
Emp. Form.:
C17H25N7O5S2
Mol. Mass.:
471.554
SMILES:
NS(=O)(=O)c1c(ccc(N2CCC(CCO)CC2)c1-c1nnn[nH]1)S(=O)(=O)C1CNC1
: