Target
Metallo-beta-lactamase VIM-2
Ligand
BDBM530931
Substrate
Meas. Tech.
Enzyme Activity: Determination of IC50
IC50
0.660±n/a nM
Citation
 Pasternak, ADong, SScott, JDTang, HZhao, ZYang, DGu, XJiang, JXiao, L Metallo-beta-lactamase inhibitors and methods of use thereof US Patent  US11207312 Publication Date 12/28/2021 
Target
Name:
Metallo-beta-lactamase VIM-2
Synonyms:
Beta-lactamase VIM-2 | Metallo-beta-lactamase VIM-2 (VIM-2)
Type:
Protein
Mol. Mass.:
28318.00
Organism:
Pseudomonas aeruginosa (g-Proteobacteria)
Description:
Residue:
266
  
Inhibitor
Name:
BDBM530931
Synonyms:
4-(4-hydroxypiperidin-1- yl)-N1-[(3R)-pyrrolidin-3- yl]-3-(1H-tetrazol-5- yl)benzene-1,2- disulfonamide | US11207312, Example 63
Type:
Small organic molecule
Emp. Form.:
C16H24N8O5S2
Mol. Mass.:
472.542
SMILES:
NS(=O)(=O)c1c(ccc(N2CCC(O)CC2)c1-c1nnn[nH]1)S(=O)(=O)N[C@@H]1CCNC1
: