Target
Metallo-beta-lactamase VIM-2
Ligand
BDBM530948
Substrate
Meas. Tech.
Enzyme Activity: Determination of IC50
IC50
0.660±n/a nM
Citation
 Pasternak, ADong, SScott, JDTang, HZhao, ZYang, DGu, XJiang, JXiao, L Metallo-beta-lactamase inhibitors and methods of use thereof US Patent  US11207312 Publication Date 12/28/2021 
Target
Name:
Metallo-beta-lactamase VIM-2
Synonyms:
Beta-lactamase VIM-2 | Metallo-beta-lactamase VIM-2 (VIM-2)
Type:
Protein
Mol. Mass.:
28318.00
Organism:
Pseudomonas aeruginosa (g-Proteobacteria)
Description:
Residue:
266
  
Inhibitor
Name:
BDBM530948
Synonyms:
N1-[(3R)-pyrrolidin-3-yl]-4- (4-sulfamoylpiperidin-1-yl)- 3-(1H-tetrazol-5- yl)benzene-1,2- disulfonamide | US11207312, Example 80
Type:
Small organic molecule
Emp. Form.:
C16H25N9O6S3
Mol. Mass.:
535.621
SMILES:
NS(=O)(=O)C1CCN(CC1)c1ccc(c(c1-c1nnn[nH]1)S(N)(=O)=O)S(=O)(=O)N[C@@H]1CCNC1
: