Target
Metallo-beta-lactamase VIM-2
Ligand
BDBM530962
Substrate
Meas. Tech.
Enzyme Activity: Determination of IC50
IC50
1.18±n/a nM
Citation
 Pasternak, ADong, SScott, JDTang, HZhao, ZYang, DGu, XJiang, JXiao, L Metallo-beta-lactamase inhibitors and methods of use thereof US Patent  US11207312 Publication Date 12/28/2021 
Target
Name:
Metallo-beta-lactamase VIM-2
Synonyms:
Beta-lactamase VIM-2 | Metallo-beta-lactamase VIM-2 (VIM-2)
Type:
Protein
Mol. Mass.:
28318.00
Organism:
Pseudomonas aeruginosa (g-Proteobacteria)
Description:
Residue:
266
  
Inhibitor
Name:
BDBM530962
Synonyms:
1-{4-[(3R)-pyrrolidin-3- ylsulfamoyl]-3-sulfamoyl-2- (1H-tetrazol-5- yl)phenyl}piperidine-4- carboxamide | US11207312, Example 94
Type:
Small organic molecule
Emp. Form.:
C17H25N9O5S2
Mol. Mass.:
499.568
SMILES:
NC(=O)C1CCN(CC1)c1ccc(c(c1-c1nnn[nH]1)S(N)(=O)=O)S(=O)(=O)N[C@@H]1CCNC1
: