Target
Metallo-beta-lactamase VIM-2
Ligand
BDBM530988
Substrate
Meas. Tech.
Enzyme Activity: Determination of IC50
IC50
0.790±n/a nM
Citation
 Pasternak, ADong, SScott, JDTang, HZhao, ZYang, DGu, XJiang, JXiao, L Metallo-beta-lactamase inhibitors and methods of use thereof US Patent  US11207312 Publication Date 12/28/2021 
Target
Name:
Metallo-beta-lactamase VIM-2
Synonyms:
Beta-lactamase VIM-2 | Metallo-beta-lactamase VIM-2 (VIM-2)
Type:
Protein
Mol. Mass.:
28318.00
Organism:
Pseudomonas aeruginosa (g-Proteobacteria)
Description:
Residue:
266
  
Inhibitor
Name:
BDBM530988
Synonyms:
(R)-N1-(3-amino-2- hydroxypropyl)-4-(4- hydroxypiperidin-1-yl)-3-(2H- tetrazol-5-yl)benzene-1,2- disulfonamide | US11207312, Example 120
Type:
Small organic molecule
Emp. Form.:
C15H24N8O6S2
Mol. Mass.:
476.531
SMILES:
NC[C@@H](O)CNS(=O)(=O)c1ccc(N2CCC(O)CC2)c(-c2nn[nH]n2)c1S(N)(=O)=O
: