Target
Metallo-beta-lactamase VIM-2
Ligand
BDBM530999
Substrate
Meas. Tech.
Enzyme Activity: Determination of IC50
IC50
1.05±n/a nM
Citation
 Pasternak, ADong, SScott, JDTang, HZhao, ZYang, DGu, XJiang, JXiao, L Metallo-beta-lactamase inhibitors and methods of use thereof US Patent  US11207312 Publication Date 12/28/2021 
Target
Name:
Metallo-beta-lactamase VIM-2
Synonyms:
Beta-lactamase VIM-2 | Metallo-beta-lactamase VIM-2 (VIM-2)
Type:
Protein
Mol. Mass.:
28318.00
Organism:
Pseudomonas aeruginosa (g-Proteobacteria)
Description:
Residue:
266
  
Inhibitor
Name:
BDBM530999
Synonyms:
(R)-N1-(3-amino-2- hydroxypropyl)-4-(4-(N-(2- aminoethyl)sulfamoyl)piperidin-1- yl)-3-(2H-tetrazol-5-yl)benzene- 1,2-disulfonamide US11207312, Example 190
Type:
Small organic molecule
Emp. Form.:
C17H30N10O7S3
Mol. Mass.:
582.678
SMILES:
NCCNS(=O)(=O)C1CCN(CC1)c1ccc(c(c1-c1nn[nH]n1)S(N)(=O)=O)S(=O)(=O)NC[C@H](O)CN
: