Target
Metallo-beta-lactamase VIM-2
Ligand
BDBM531016
Substrate
Meas. Tech.
Enzyme Activity: Determination of IC50
IC50
1.50±n/a nM
Citation
 Pasternak, ADong, SScott, JDTang, HZhao, ZYang, DGu, XJiang, JXiao, L Metallo-beta-lactamase inhibitors and methods of use thereof US Patent  US11207312 Publication Date 12/28/2021 
Target
Name:
Metallo-beta-lactamase VIM-2
Synonyms:
Beta-lactamase VIM-2 | Metallo-beta-lactamase VIM-2 (VIM-2)
Type:
Protein
Mol. Mass.:
28318.00
Organism:
Pseudomonas aeruginosa (g-Proteobacteria)
Description:
Residue:
266
  
Inhibitor
Name:
BDBM531016
Synonyms:
4-(3-hydroxy-2-oxopiperidin-1-yl)-N1-((R)-pyrrolidin-3-yl)-3-(2H-tetrazol-5-yl)benzene-1,2-disulfonamide | US11207312, Example 148
Type:
Small organic molecule
Emp. Form.:
C16H22N8O6S2
Mol. Mass.:
486.526
SMILES:
NS(=O)(=O)c1c(ccc(N2CCCC(O)C2=O)c1-c1nn[nH]n1)S(=O)(=O)N[C@@H]1CCNC1
: