Target
Metallo-beta-lactamase VIM-2
Ligand
BDBM531036
Substrate
Meas. Tech.
Enzyme Activity: Determination of IC50
IC50
0.480±n/a nM
Citation
 Pasternak, ADong, SScott, JDTang, HZhao, ZYang, DGu, XJiang, JXiao, L Metallo-beta-lactamase inhibitors and methods of use thereof US Patent  US11207312 Publication Date 12/28/2021 
Target
Name:
Metallo-beta-lactamase VIM-2
Synonyms:
Beta-lactamase VIM-2 | Metallo-beta-lactamase VIM-2 (VIM-2)
Type:
Protein
Mol. Mass.:
28318.00
Organism:
Pseudomonas aeruginosa (g-Proteobacteria)
Description:
Residue:
266
  
Inhibitor
Name:
BDBM531036
Synonyms:
(S)-4-(4-(1H-imidazol-4-yl)piperidin-1-yl)-N1-(2,3-diaminopropyl)-3-(2H-tetrazol-5-yl)benzene-1,2-disulfonamide | US11207312, Example 168
Type:
Small organic molecule
Emp. Form.:
C18H27N11O4S2
Mol. Mass.:
525.608
SMILES:
NC[C@H](N)CNS(=O)(=O)c1ccc(N2CCC(CC2)c2c[nH]cn2)c(-c2nn[nH]n2)c1S(N)(=O)=O
: