Target
Metallo-beta-lactamase VIM-2
Ligand
BDBM531059
Substrate
Meas. Tech.
Enzyme Activity: Determination of IC50
IC50
1.15±n/a nM
Citation
 Pasternak, ADong, SScott, JDTang, HZhao, ZYang, DGu, XJiang, JXiao, L Metallo-beta-lactamase inhibitors and methods of use thereof US Patent  US11207312 Publication Date 12/28/2021 
Target
Name:
Metallo-beta-lactamase VIM-2
Synonyms:
Beta-lactamase VIM-2 | Metallo-beta-lactamase VIM-2 (VIM-2)
Type:
Protein
Mol. Mass.:
28318.00
Organism:
Pseudomonas aeruginosa (g-Proteobacteria)
Description:
Residue:
266
  
Inhibitor
Name:
BDBM531059
Synonyms:
(R)-N1-(pyrrolidin-3-yl)-3-(2H-tetrazol-5-yl)-4-(2-thioxoimidazolidin-1-yl)benzene-1,2-disulfonamide | US11207312, Example 191
Type:
Small organic molecule
Emp. Form.:
C14H19N9O4S3
Mol. Mass.:
473.554
SMILES:
NS(=O)(=O)c1c(ccc(N2CCNC2=S)c1-c1nn[nH]n1)S(=O)(=O)N[C@@H]1CCNC1
: