Target
Metallo-beta-lactamase VIM-2
Ligand
BDBM531073
Substrate
Meas. Tech.
Enzyme Activity: Determination of IC50
IC50
1.07±n/a nM
Citation
 Pasternak, ADong, SScott, JDTang, HZhao, ZYang, DGu, XJiang, JXiao, L Metallo-beta-lactamase inhibitors and methods of use thereof US Patent  US11207312 Publication Date 12/28/2021 
Target
Name:
Metallo-beta-lactamase VIM-2
Synonyms:
Beta-lactamase VIM-2 | Metallo-beta-lactamase VIM-2 (VIM-2)
Type:
Protein
Mol. Mass.:
28318.00
Organism:
Pseudomonas aeruginosa (g-Proteobacteria)
Description:
Residue:
266
  
Inhibitor
Name:
BDBM531073
Synonyms:
(R,Z)-N1-(3-amino-2-hydroxypropyl)-4-(3-(2-aminoethylidene) piperidin-1-yl)-3-(2H-tetrazol-5-yl)benzene-1,2-disulfonamide and (R,E)-N1-(3-amino-2-hydroxypropyl)-4-(3-(2-aminoethylidene) piperidine-1-yl)-3-(2H-tetrazol-5-yl)benzene-1,2-disulfonamide US11207312, Example 206
Type:
Small organic molecule
Emp. Form.:
C17H27N9O5S2
Mol. Mass.:
501.584
SMILES:
NC\C=C1/CCCN(C1)c1ccc(c(c1-c1nn[nH]n1)S(N)(=O)=O)S(=O)(=O)NC[C@H](O)CN
: