Target
Histone deacetylase 6
Ligand
BDBM323709
Substrate
Meas. Tech.
IC50 Assay
IC50
48.0±n/a nM
Citation
 Hooker, JWang, CStrebl-Bantillo, MG HDAC6 inhibitors and imaging agents US Patent  US11207431 Publication Date 12/28/2021 
Target
Name:
Histone deacetylase 6
Synonyms:
Cereblon/Histone deacetylase 6 HDAC6 Histone deacetylase 6 (HDAC6) KIAA0901 | ORF Names:JM21
Type:
Chromatin regulator; hydrolase; repressor
Mol. Mass.:
131381.51
Organism:
Homo sapiens (Human)
Description:
Q9UBN7
Residue:
1215
  
Inhibitor
Name:
BDBM323709
Synonyms:
US10188756, Compound CN133 | US11207431, Martinostat
Type:
Small organic molecule
Emp. Form.:
C22H30N2O2
Mol. Mass.:
354.4858
SMILES:
CN(Cc1ccc(\C=C\C(=O)NO)cc1)CC12CC3CC(CC(C3)C1)C2
: