Target
Fibroblast growth factor receptor 1
Ligand
BDBM445240
Substrate
Meas. Tech.
FGFR1 Enzyme Inhibition
Ki
15.3±n/a nM
Citation
 Walters, IBirch, LCollingwood, SPStevenson, CS Indole derivatives and their use as protein kinase inhibitors US Patent  US11208381 Publication Date 12/28/2021 
Target
Name:
Fibroblast growth factor receptor 1
Synonyms:
BFGFR Basic fibroblast growth factor receptor 1 (FGFR1) CEK FGFR-1 FGFR-1, (FL) FGFR1_HUMAN FLT2 Fibroblast growth factor receptor 1 (FGFR-1) Fms-like tyrosine kinase 2 N-sam bFGF-R | c-fgr
Type:
Receptor
Mol. Mass.:
91861.70
Organism:
Homo sapiens (Human)
Description:
P11362
Residue:
822
  
Inhibitor
Name:
BDBM445240
Synonyms:
US10669235, Example 31 | US11208381, Example 31
Type:
Small organic molecule
Emp. Form.:
C35H39N5O5
Mol. Mass.:
609.7147
SMILES:
COC(=O)c1cc2NC(=O)\C(=C(/Nc3ccc(cc3)C(=O)N3CCC(CC3)C(=O)NCCN(C)C)c3ccccc3)c2cc1C
: