Target
Protein O-GlcNAcase
Ligand
BDBM532948
Substrate
Meas. Tech.
Enzyme Assay
IC50
1.24±0.66 nM
Citation
 Dreyfus, NJFaller, A 2,3-dihydrofuro[2,3-b]pyridine compounds US Patent  US11214576 Publication Date 1/4/2022 
Target
Name:
Protein O-GlcNAcase
Synonyms:
2-acetamido-2-deoxy-β-D-glucopyranosidase (O-GlcNAcase) Beta-hexosaminidase (O-GlcNAcase) HEXC MEA5 N-acetyl-beta-D-glucosaminidase (O-GlcNAcase) OGA Protein O-GlcNAcase
Type:
Enzyme
Mol. Mass.:
102874.67
Organism:
Homo sapiens (Human)
Description:
O60502
Residue:
916
  
Inhibitor
Name:
BDBM532948
Synonyms:
(?)-6-[1-[4-(5-methyl-1,3,4-oxadiazol-2-yl)-1-piperidyl]ethyl]-2,3-dihydrofuro[2,3-b]pyridine | US11214576, Example 1
Type:
Small organic molecule
Emp. Form.:
C17H22N4O2
Mol. Mass.:
314.3822
SMILES:
CC(N1CCC(CC1)c1nnc(C)o1)c1ccc2CCOc2n1
: