Target
Protein kinase C beta type
Ligand
BDBM533432
Substrate
Meas. Tech.
Protein Kinase C beta 2 Assay
Ki
5.43±n/a nM
Citation
 Li, HNukui, SScales, SATeng, MYin, C Substituted n-pyrimidin-4-yl-3-amino-pyrrolo[3,4-c]pyrazoles as protein kinase C inhibitors US Patent  US11220518 Publication Date 1/11/2022 
Target
Name:
Protein kinase C beta type
Synonyms:
KPCB_HUMAN PKC beta PKCB PRKCB1 Protein kinase C beta type | Protein kinase C beta type II (PRKCB2)
Type:
Enzyme
Mol. Mass.:
76873.67
Organism:
Homo sapiens (Human)
Description:
The recombinant human PKC enzymes were produced using a baculovirus expression system in SF9 cells
Residue:
671
  
Inhibitor
Name:
BDBM533432
Synonyms:
US11220518, Ex. No. D1 | US11780853, Example D1
Type:
Small organic molecule
Emp. Form.:
C22H33FN8O
Mol. Mass.:
444.5488
SMILES:
CCc1ncc(F)c(Nc2n[nH]c3c2CN(C(=O)N2CC(C)(C)N(C)C[C@@H]2C)C3(C)C)n1
: