Target
Oxysterols receptor LXR-beta
Ligand
BDBM304437
Substrate
Meas. Tech.
LXR alpha/beta Radioligand Binding Assay
Ki
9.00±n/a nM
Citation
 Claremon, DADong, CFan, YLeftheris, KLotesta, SDSingh, SBTice, CMZhao, WZheng, YZhuang, L Piperazine derivatives as liver X receptor modulators US Patent  US10144715 Publication Date 12/4/2018 
Target
Name:
Oxysterols receptor LXR-beta
Synonyms:
LXRB Liver X, LXR beta NR1H2 Nuclear receptor NER Ubiquitously-expressed nuclear receptor
Type:
Enzyme Catalytic Domain
Mol. Mass.:
50978.79
Organism:
Homo sapiens (Human)
Description:
P55055
Residue:
460
  
Inhibitor
Name:
BDBM304437
Synonyms:
(R)-1-(2-((R)-4-(4-fluoro-3-(methylsulfonyl)phenyl)-2-isopropylpiperazin-1-yl)-4-(trifluoromethyl)pyrimidin-5-yl)propan-1-ol | US10144715, Compound 12-7
Type:
Small organic molecule
Emp. Form.:
C22H28F4N4O3S
Mol. Mass.:
504.541
SMILES:
CC[C@@H](O)c1cnc(nc1C(F)(F)F)N1CCN(C[C@H]1C(C)C)c1ccc(F)c(c1)S(C)(=O)=O
: