Target
Oxysterols receptor LXR-beta
Ligand
BDBM304444
Substrate
Meas. Tech.
LXR alpha/beta Radioligand Binding Assay
Ki
1.000±n/a nM
Citation
 Claremon, DADong, CFan, YLeftheris, KLotesta, SDSingh, SBTice, CMZhao, WZheng, YZhuang, L Piperazine derivatives as liver X receptor modulators US Patent  US10144715 Publication Date 12/4/2018 
Target
Name:
Oxysterols receptor LXR-beta
Synonyms:
LXRB Liver X, LXR beta NR1H2 Nuclear receptor NER Ubiquitously-expressed nuclear receptor
Type:
Enzyme Catalytic Domain
Mol. Mass.:
50978.79
Organism:
Homo sapiens (Human)
Description:
P55055
Residue:
460
  
Inhibitor
Name:
BDBM304444
Synonyms:
(R)-(4-(3-isopropyl-4-(5-(prop-1-en-2-yl)-4-(trifluoromethyl)pyrimidin-2-yl)piperazin-1-yl)-2-(methylsulfonyl)phenyl)methanol | US10144715, Compound 14-2
Type:
Small organic molecule
Emp. Form.:
C23H29F3N4O3S
Mol. Mass.:
498.562
SMILES:
CC(C)[C@@H]1CN(CCN1c1ncc(C(C)=C)c(n1)C(F)(F)F)c1ccc(CO)c(c1)S(C)(=O)=O
: