Target
Oxysterols receptor LXR-beta
Ligand
BDBM304697
Substrate
Meas. Tech.
LXR alpha/beta Radioligand Binding Assay
Ki
6.00±n/a nM
Citation
 Claremon, DADong, CFan, YLeftheris, KLotesta, SDSingh, SBTice, CMZhao, WZheng, YZhuang, L Piperazine derivatives as liver X receptor modulators US Patent  US10144715 Publication Date 12/4/2018 
Target
Name:
Oxysterols receptor LXR-beta
Synonyms:
LXRB Liver X, LXR beta NR1H2 Nuclear receptor NER Ubiquitously-expressed nuclear receptor
Type:
Enzyme Catalytic Domain
Mol. Mass.:
50978.79
Organism:
Homo sapiens (Human)
Description:
P55055
Residue:
460
  
Inhibitor
Name:
BDBM304697
Synonyms:
4-((S)-3-isopropyl-4-(((1s,4R)-4-(trifluoromethyl)cyclohexyl)methyl)piperazin-1-yl)-2-(methylsulfonyl)benzonitrile | US10144715, Compound 50-1
Type:
Small organic molecule
Emp. Form.:
C23H32F3N3O2S
Mol. Mass.:
471.579
SMILES:
CC(C)[C@H]1CN(CCN1C[C@H]1CC[C@H](CC1)C(F)(F)F)c1ccc(C#N)c(c1)S(C)(=O)=O
: