Target
Hemagglutinin
Ligand
BDBM535847
Substrate
Meas. Tech.
Determination of Antiviral Activity
IC50
7380±n/a nM
Citation
 Salama, ZB Organosilicon carriers for use in treating infections and/or diseases caused by SARS viruses US Patent  US11241393 Publication Date 2/8/2022 
Target
Name:
Hemagglutinin
Synonyms:
HA Hemagglutinin HA1 chain | Hemagglutinin HA2 chain
Type:
PROTEIN
Mol. Mass.:
63416.64
Organism:
Influenza A virus (strain A/Aichi/2/1968 H3N2)
Description:
ChEMBL_795513
Residue:
566
  
Inhibitor
Name:
BDBM535847
Synonyms:
US11241393, Sil 2
Type:
Small organic molecule
Emp. Form.:
C20H42O6Si
Mol. Mass.:
406.6294
SMILES:
CCCCCCCCCC[Si](C)(C)CCOC1OC(CO)C(O)C(O)C1O
: