Target
Non-receptor tyrosine-protein kinase TYK2
Ligand
BDBM350090
Substrate
Meas. Tech.
Biochemical JAK Kinase Assay
Ki
0.400±n/a nM
Citation
 Fatheree, PRBrandt, GESmith, CSullivan, SDVan Orden, LJ Fused imidazo-piperidine JAK inhibitors US Patent  US11254669 Publication Date 2/22/2022 
Target
Name:
Non-receptor tyrosine-protein kinase TYK2
Synonyms:
Non-receptor tyrosine-protein kinase TYK2 (TYK2) TYK2_HUMAN | Tyrosine-protein kinase TYK2
Type:
Protein
Mol. Mass.:
133666.03
Organism:
Homo sapiens (Human)
Description:
P29597
Residue:
1187
  
Inhibitor
Name:
BDBM350090
Synonyms:
((S)-3-(dimethylamino)pyrrolidin-1-yl)((S)-5-ethyl-2-(6-(2-ethyl-5-fluoro-4-hydroxyphenyl)-1H-indazol-3-yl)-4,5,6,7-tetrahydro-3H-imidazo[4,5-c]pyridin-6-yl)methanone US10519153, Example 3 US11254669, Example 3 US11713315, Example C-6
Type:
Small organic molecule
Emp. Form.:
C31H38FN7O2
Mol. Mass.:
559.6775
SMILES:
CCc1cc(O)c(F)cc1-c1ccc2c(n[nH]c2c1)-c1nc2C[C@H](N(Cc2[nH]1)C(C)C)C(=O)N1CC[C@@H](C1)N(C)C
: