Target
Tyrosine-protein kinase JAK2
Ligand
BDBM539141
Substrate
Meas. Tech.
Biochemical JAK Kinase Assay
Ki
0.040±n/a nM
Citation
 Fatheree, PRBrandt, GESmith, CSullivan, SDVan Orden, LJ Fused imidazo-piperidine JAK inhibitors US Patent  US11254669 Publication Date 2/22/2022 
Target
Name:
Tyrosine-protein kinase JAK2
Synonyms:
JAK-2 JAK2_HUMAN Janus kinase 2 (JAK2) | Janus kinase 2 (a protein tyrosine kinase)
Type:
Protein
Mol. Mass.:
130684.68
Organism:
Homo sapiens (Human)
Description:
O60674
Residue:
1132
  
Inhibitor
Name:
BDBM539141
Synonyms:
US11254669, Example 1-37 | US11667637, Example 1-37
Type:
Small organic molecule
Emp. Form.:
C32H40FN7O2
Mol. Mass.:
573.7041
SMILES:
CCN1Cc2[nH]c(nc2C[C@@H]1C(=O)N1CCN(CC1)C(C)(C)C)-c1n[nH]c2cc(ccc12)-c1cc(F)c(O)cc1CC
: