Target
Proto-oncogene tyrosine-protein kinase receptor Ret
Ligand
BDBM305327
Substrate
Meas. Tech.
RET Enzyme Assay
IC50
15.1±n/a nM
Citation
 Andrews, SWAronow, SBlake, JFBrandhuber, BJCollier, JCook, AHaas, JJiang, YKolakowski, GRMcFaddin, EAMcKenney, MLMcNulty, OTMetcalf, ATMoreno, DARamann, GATang, TPRen, LWalls, SM Substituted pyrazolo[1,5-A]pyridine compounds as RET kinase inhibitors US Patent  US10144734 Publication Date 12/4/2018 
Target
Name:
Proto-oncogene tyrosine-protein kinase receptor Ret
Synonyms:
CDHF12 Cadherin family member 12 Proto-oncogene c-Ret RET51 Tyrosine-protein kinase Ret (RET)
Type:
Protein
Mol. Mass.:
124318.29
Organism:
Homo sapiens (Human)
Description:
P07949
Residue:
1114
  
Inhibitor
Name:
BDBM305327
Synonyms:
N-(1-(5-(3-cyano-6- ethoxypyrazolo[1,5- a]pyridin-4-yl)pyridin-2- yl)-4- (hydroxymethyl)piperidin- 4-yl)-3-fluoropicolinamide US10172845, Example 343 US10881652, Example 343 | US11648243, Example 343
Type:
Small organic molecule
Emp. Form.:
C27H26FN7O3
Mol. Mass.:
515.5388
SMILES:
CCOc1cc(-c2ccc(nc2)N2CCC(CO)(CC2)NC(=O)c2ncccc2F)c2c(cnn2c1)C#N
: